Reaction Details
TargetTyrosine-protein kinase SYK
LigandBDBM50223190
Substrate/Competitorn/a
Meas. Tech.ChEMBL_201611 (CHEMBL807574)
IC50>113000±n/a nM
Citation Cywin, CLZhao, BPMcNeil, DWHrapchak, MProkopowicz, ASGoldberg, DRMorwick, TMGao, AJakes, SKashem, MMagolda, RLSoll, RMPlayer, MRBobko, MARinker, JDesJarlais, RLWinters, MP Discovery and SAR of novel Naphthyridines as potent inhibitors of spleen tyrosine kinase (SYK). Bioorg Med Chem Lett13:1415-8 (2003) Tyrosine-protein kinase SYK
Name:Tyrosine-protein kinase SYK
Type:Enzyme
Mol. Mass.:72079.99
Organism:Homo sapiens (Human)
Description:P43405
Residue:635
BDBM50223190
NameBDBM50223190
Synonyms:CHEMBL417315
TypeSmall organic molecule
Emp. Form.C17H16N2O
Mol. Mass.264.3217
SMILESCNc1nc(cc2ccccc12)-c1ccc(OC)cc1