Reaction Details
TargetcGMP-specific 3',5'-cyclic phosphodiesterase
LigandBDBM50126452
Substrate/Competitorn/a
Meas. Tech.ChEBML_155207
IC50 1.5±n/a nM
Citation Maw, GNAllerton, CMGbekor, EMillion, WA Design, synthesis and biological activity of beta-carboline-based type-5 phosphodiesterase inhibitors. Bioorg Med Chem Lett13:1425-8 (2003) cGMP-specific 3',5'-cyclic phosphodiesterase
Name:cGMP-specific 3',5'-cyclic phosphodiesterase
Type:Protein
Mol. Mass.:99975.83
Organism:Homo sapiens (Human)
Description:O76074
Residue:875
BDBM50126452
NameBDBM50126452
Synonyms:(6R,12aR)-6-Benzo[1,3]dioxol-5-yl-2-[(R)-1-(2-pyridin-2-yl-ethyl)-pyrrolidin-3-yl]-2,3,6,7,12,12a-hexahydro-pyrazino[1',2':1,6]pyrido[3,4-b]indole-1,4-dione | CHEMBL284070
TypeSmall organic molecule
Emp. Form.C32H31N5O4
Mol. Mass.549.6196
SMILESO=C1CN([C@@H]2CCN(CCc3ccccn3)C2)C(=O)[C@H]2Cc3c([nH]c4ccccc34)[C@H](N12)c1ccc2OCOc2c1