Reaction Details
TargetDual 3',5'-cyclic-AMP and -GMP phosphodiesterase 11A
LigandBDBM50126467
Substrate/Competitorn/a
Meas. Tech.ChEBML_156293
IC50 3.5±n/a nM
Citation Maw, GNAllerton, CMGbekor, EMillion, WA Design, synthesis and biological activity of beta-carboline-based type-5 phosphodiesterase inhibitors. Bioorg Med Chem Lett13:1425-8 (2003) Dual 3',5'-cyclic-AMP and -GMP phosphodiesterase 11A
Name:Dual 3',5'-cyclic-AMP and -GMP phosphodiesterase 11A
Type:Enzyme
Mol. Mass.:104751.53
Organism:Homo sapiens (Human)
Description:Q9HCR9
Residue:933
BDBM50126467
NameBDBM50126467
Synonyms:(6R,12aR)-6-Benzo[1,3]dioxol-5-yl-2-{(R)-1-[2-(1H-imidazol-2-yl)-ethyl]-pyrrolidin-3-yl}-2,3,6,7,12,12a-hexahydro-pyrazino[1',2':1,6]pyrido[3,4-b]indole-1,4-dione | CHEMBL418594
TypeSmall organic molecule
Emp. Form.C30H30N6O4
Mol. Mass.538.597
SMILESO=C1CN([C@@H]2CCN(CCc3ncc[nH]3)C2)C(=O)[C@H]2Cc3c([nH]c4ccccc34)[C@H](N12)c1ccc2OCOc2c1