Reaction Details
TargetDual 3',5'-cyclic-AMP and -GMP phosphodiesterase 11A
LigandBDBM50126456
Substrate/Competitorn/a
Meas. Tech.ChEBML_156293
IC50 4.7±n/a nM
Citation Maw, GNAllerton, CMGbekor, EMillion, WA Design, synthesis and biological activity of beta-carboline-based type-5 phosphodiesterase inhibitors. Bioorg Med Chem Lett13:1425-8 (2003) Dual 3',5'-cyclic-AMP and -GMP phosphodiesterase 11A
Name:Dual 3',5'-cyclic-AMP and -GMP phosphodiesterase 11A
Type:Enzyme
Mol. Mass.:104751.53
Organism:Homo sapiens (Human)
Description:Q9HCR9
Residue:933
BDBM50126456
NameBDBM50126456
Synonyms:(6R,12aR)-2-[(R)-1-(3-Azetidin-1-yl-3-oxo-propyl)-pyrrolidin-3-yl]-6-benzo[1,3]dioxol-5-yl-2,3,6,7,12,12a-hexahydro-pyrazino[1',2':1,6]pyrido[3,4-b]indole-1,4-dione | CHEMBL286309
TypeSmall organic molecule
Emp. Form.C31H33N5O5
Mol. Mass.555.6242
SMILESO=C(CCN1CC[C@H](C1)N1CC(=O)N2[C@H](Cc3c([nH]c4ccccc34)[C@H]2c2ccc3OCOc3c2)C1=O)N1CCC1