Reaction Details
TargetDual 3',5'-cyclic-AMP and -GMP phosphodiesterase 11A
LigandBDBM50126462
Substrate/Competitorn/a
Meas. Tech.ChEMBL_156293 (CHEMBL759930)
IC50 1.40±n/a nM
Citation Maw, GNAllerton, CMGbekor, EMillion, WA Design, synthesis and biological activity of beta-carboline-based type-5 phosphodiesterase inhibitors. Bioorg Med Chem Lett13:1425-8 (2003) Dual 3',5'-cyclic-AMP and -GMP phosphodiesterase 11A
Name:Dual 3',5'-cyclic-AMP and -GMP phosphodiesterase 11A
Type:Enzyme
Mol. Mass.:104751.53
Organism:Homo sapiens (Human)
Description:Q9HCR9
Residue:933
BDBM50126462
NameBDBM50126462
Synonyms:(6R,12aR)-6-Benzo[1,3]dioxol-5-yl-2-{(R)-1-[2-(1-methyl-1H-imidazol-2-yl)-ethyl]-pyrrolidin-3-yl}-2,3,6,7,12,12a-hexahydro-pyrazino[1',2':1,6]pyrido[3,4-b]indole-1,4-dione | CHEMBL282515
TypeSmall organic molecule
Emp. Form.C31H32N6O4
Mol. Mass.552.6236
SMILESCn1ccnc1CCN1CC[C@H](C1)N1CC(=O)N2[C@H](Cc3c([nH]c4ccccc34)[C@H]2c2ccc3OCOc3c2)C1=O