Reaction Details
TargetProthrombin
LigandBDBM50126492
Substrate/Competitorn/a
Meas. Tech.ChEBML_208513
Ki 4.5±n/a nM
Citation Sanderson, PECutrona, KJSavage, KLNaylor-Olsen, AMBickel, DJBohn, DLClayton, FCKrueger, JALewis, SDLucas, BJLyle, EAWallace, AAWelsh, DCYan, Y 3-amino-4-sulfonylpyridinone acetamide and related pyridothiadiazine thrombin inhibitors. Bioorg Med Chem Lett13:1441-4 (2003) Prothrombin
Name:Prothrombin
Type:Protein
Mol. Mass.:70029.57
Organism:Homo sapiens (Human)
Description:P00734
Residue:622
BDBM50126492
NameBDBM50126492
Synonyms:2-[3-Amino-4-(cyclopropylmethyl-sulfamoyl)-6-methyl-2-oxo-2H-pyridin-1-yl]-N-(6-amino-2-methyl-pyridin-3-ylmethyl)-acetamide | CHEMBL32280
TypeSmall organic molecule
Emp. Form.C19H26N6O4S
Mol. Mass.434.513
SMILESCc1cc(c(N)c(=O)n1CC(=O)NCc1ccc(N)nc1C)S(=O)(=O)NCC1CC1