Reaction Details
TargetProthrombin
LigandBDBM50126528
Substrate/Competitorn/a
Meas. Tech.ChEBML_208514
Ki 0.023000±n/a nM
Citation Boatman, PDUrban, JNguyen, MQabar, MKahn, M High-throughput synthesis and optimization of thrombin inhibitors via urazole alpha-addition and Michael addition. Bioorg Med Chem Lett13:1445-9 (2003) Prothrombin
Name:Prothrombin
Type:Protein
Mol. Mass.:70029.57
Organism:Homo sapiens (Human)
Description:P00734
Residue:622
BDBM50126528
NameBDBM50126528
Synonyms:2-{5-[(4-Amino-cyclohexylmethyl)-carbamoyl]-1,3-dioxo-5,8-dihydro-[1,2,4]triazolo[1,2-a]pyridazin-2-yl}-3-(4-bromo-phenylsulfanyl)-propionic acid methyl ester | CHEMBL36012
TypeSmall organic molecule
Emp. Form.C24H30BrN5O5S
Mol. Mass.580.495
SMILESCOC(=O)C(CSc1ccc(Br)cc1)n1c(=O)n2CC=CC(C(=O)NC[C@H]3CC[C@H](N)CC3)n2c1=O