Reaction Details
TargetCoagulation factor VII
LigandBDBM50126571
Substrate/Competitorn/a
Meas. Tech.ChEBML_48455
Ki 27±n/a nM
Citation Klingler, OMatter, HSchudok, MBajaj, SPCzech, JLorenz, MNestler, HPSchreuder, HWildgoose, P Design, synthesis, and structure-activity relationship of a new class of amidinophenylurea-based factor VIIa inhibitors. Bioorg Med Chem Lett13:1463-7 (2003) Coagulation factor VII
Name:Coagulation factor VII
Type:Enzyme
Mol. Mass.:51599.89
Organism:Homo sapiens (Human)
Description:n/a
Residue:466
BDBM50126571
NameBDBM50126571
Synonyms:CHEMBL35586 N-[1-((S)-3-Bromo-phenyl)-ethyl]-2-[3-(4-carbamimidoyl-phenyl)-ureido]-acetamide
TypeSmall organic molecule
Emp. Form.C18H20BrN5O2
Mol. Mass.418.288
SMILESC[C@H](NC(=O)CNC(=O)Nc1ccc(cc1)C(N)=N)c1cccc(Br)c1