Reaction Details
TargetIntegrin alpha-V/beta-3
LigandBDBM50126598
Substrate/Competitorn/a
Meas. Tech.ChEMBL_217804 (CHEMBL823260)
Ki 170±n/a nM
Citation Miller, WHManley, PJCousins, RDErhard, KFHeerding, DAKwon, CRoss, STSamanen, JMTakata, DTUzinskas, INYuan, CCHaltiwanger, RCGress, CJLark, MWHwang, SMJames, IERieman, DJWillette, RNYue, TLAzzarano, LMSalyers, KLSmith, BRWard, KWJohanson, KOHuffman, WF Phenylbutyrates as potent, orally bioavailable vitronectin receptor (integrin alphavbeta3) antagonists. Bioorg Med Chem Lett13:1483-6 (2003) Integrin alpha-V/beta-3
Name:Integrin alpha-V/beta-3
Type:Enzyme
Mol. Mass.:n/a
Description:n/a
Components:This complex has 2 components.
Component 1
Name:Integrin alpha-V
Synonyms:ITAV_HUMAN Integrin alpha-V/alpha-5 VNRA Vitronectin receptor | Vitronectin receptor subunit alpha
Type:PROTEIN
Mol. Mass.:116024.92
Organism:Homo sapiens (Human)
Description:ChEMBL_582336
Residue:1048
Component 2
Name:Integrin beta-3
Synonyms:CD_antigen=CD61 GPIIIa ITGB3 Platelet membrane glycoprotein IIIa
Type:Protein
Mol. Mass.:87038.91
Organism:Homo sapiens (Human)
Description:P05106
Residue:788
BDBM50126598
NameBDBM50126598
Synonyms:3-Phenyl-4-{4-[3-(pyridin-2-ylamino)-propoxy]-phenyl}-butyric acid | CHEMBL415692
TypeSmall organic molecule
Emp. Form.C24H26N2O3
Mol. Mass.390.4748
SMILESOC(=O)C[C@@H](Cc1ccc(OCCCNc2ccccn2)cc1)c1ccccc1