Reaction Details
TargetMatrix metalloproteinase-9
LigandBDBM50126612
Substrate/Competitorn/a
Meas. Tech.ChEBML_105528
IC50 1±n/a nM
Citation Zask, AGu, YAlbright, JDDu, XHogan, MLevin, JIChen, JMKillar, LMSung, ADiJoseph, JFSharr, MARoth, CESkala, SJin, GCowling, RMohler, KMBarone, DBlack, RMarch, CSkotnicki, JS Synthesis and SAR of bicyclic heteroaryl hydroxamic acid MMP and TACE inhibitors. Bioorg Med Chem Lett13:1487-90 (2003) Matrix metalloproteinase-9
Name:Matrix metalloproteinase-9
Type:Enzyme
Mol. Mass.:78452.28
Organism:Homo sapiens (Human)
Description:P14780
Residue:707
BDBM50126612
NameBDBM50126612
Synonyms:4-{[4-(4-Chloro-phenoxy)-benzenesulfonyl]-methyl-amino}-1,3-dimethyl-1H-pyrazolo[3,4-b]pyridine-5-carboxylic acid hydroxyamide | CHEMBL286848
TypeSmall organic molecule
Emp. Form.C22H20ClN5O5S
Mol. Mass.501.943
SMILESCN(c1c(cnc2n(C)nc(C)c12)C(=O)NO)S(=O)(=O)c1ccc(Oc2ccc(Cl)cc2)cc1