Reaction Details
TargetCollagenase 3
LigandBDBM50126620
Substrate/Competitorn/a
Meas. Tech.ChEBML_106642
IC50 1±n/a nM
Citation Zask, AGu, YAlbright, JDDu, XHogan, MLevin, JIChen, JMKillar, LMSung, ADiJoseph, JFSharr, MARoth, CESkala, SJin, GCowling, RMohler, KMBarone, DBlack, RMarch, CSkotnicki, JS Synthesis and SAR of bicyclic heteroaryl hydroxamic acid MMP and TACE inhibitors. Bioorg Med Chem Lett13:1487-90 (2003) Collagenase 3
Name:Collagenase 3
Type:Enzyme
Mol. Mass.:53808.06
Organism:Homo sapiens (Human)
Description:P45452
Residue:471
BDBM50126620
NameBDBM50126620
Synonyms:4-[(4-Methoxy-benzenesulfonyl)-pyridin-3-ylmethyl-amino]-7-trifluoromethyl-quinoline-3-carboxylic acid hydroxyamide N-hydroxy-4-(4-methoxy-N-(pyridin-3-ylmethyl)phenylsulfonamido)-7-(trifluoromethyl)quinoline-3-carboxamide
TypeSmall organic molecule
Emp. Form.C24H19F3N4O5S
Mol. Mass.532.492
SMILESCOc1ccc(cc1)S(=O)(=O)N(Cc1cccnc1)c1c(cnc2cc(ccc12)C(F)(F)F)C(=O)NO