Reaction Details
TargetProthrombin
LigandBDBM50126641
Substrate/Competitorn/a
Meas. Tech.ChEBML_208521
Ki 31±n/a nM
Citation Tomczuk, BLu, TSoll, RMFedde, CWang, AMurphy, LCrysler, CDasgupta, MEisennagel, SSpurlino, JBone, R Oxyguanidines: application to non-peptidic phenyl-based thrombin inhibitors. Bioorg Med Chem Lett13:1495-8 (2003) Prothrombin
Name:Prothrombin
Type:Protein
Mol. Mass.:70029.57
Organism:Homo sapiens (Human)
Description:P00734
Residue:622
BDBM50126641
NameBDBM50126641
Synonyms:3-[3-({[(Z)-amino(imino)methyl]amino}oxy)propoxy]-5-methylphenyl 1,2,3,4-tetrahydroquinoline-8-sulfonate | CHEMBL289367
TypeSmall organic molecule
Emp. Form.C20H26N4O5S
Mol. Mass.434.509
SMILESCc1cc(OCCCONC(N)=N)cc(OS(=O)(=O)c2cccc3CCCNc23)c1