Reaction Details
TargetProthrombin
LigandBDBM50126642
Substrate/Competitorn/a
Meas. Tech.ChEBML_208521
Ki 6.7±n/a nM
Citation Tomczuk, BLu, TSoll, RMFedde, CWang, AMurphy, LCrysler, CDasgupta, MEisennagel, SSpurlino, JBone, R Oxyguanidines: application to non-peptidic phenyl-based thrombin inhibitors. Bioorg Med Chem Lett13:1495-8 (2003) Prothrombin
Name:Prothrombin
Type:Protein
Mol. Mass.:70029.57
Organism:Homo sapiens (Human)
Description:P00734
Residue:622
BDBM50126642
NameBDBM50126642
Synonyms:3-[3-({[(Z)-amino(imino)methyl]amino}oxy)propoxy]-5-methylphenyl 2-methoxybenzenesulfonate | CHEMBL36943
TypeSmall organic molecule
Emp. Form.C18H23N3O6S
Mol. Mass.409.457
SMILESCOc1ccccc1S(=O)(=O)Oc1cc(C)cc(OCCCONC(N)=N)c1