Reaction Details
TargetSerine/threonine-protein kinase Sgk1
LigandBDBM50126732
Substrate/Competitorn/a
Meas. Tech.ChEMBL_200938 (CHEMBL810846)
IC50>1000±n/a nM
Citation Goldberg, DRButz, TCardozo, MGEckner, RJHammach, AHuang, JJakes, SKapadia, SKashem, MLukas, SMorwick, TMPanzenbeck, MPatel, UPav, SPeet, GWPeterson, JDProkopowicz, ASSnow, RJSellati, RTakahashi, HTan, JTschantz, MAWang, XJWang, YWolak, JXiong, PMoss, N Optimization of 2-phenylaminoimidazo[4,5-h]isoquinolin-9-ones: orally active inhibitors of lck kinase. J Med Chem46:1337-49 (2003) 
 
Serine/threonine-protein kinase Sgk1
Name:Serine/threonine-protein kinase Sgk1
Type:Other Protein Type
Mol. Mass.:48954.40
Organism:Homo sapiens (Human)
Description:Recombinant human SGK-1 enzyme produced in a baculovirus system.
Residue:431
BDBM50126732
NameBDBM50126732
Synonyms:2-(2,6-Dichloro-phenylamino)-7-(3-diethylamino-propenyl)-1,6-dimethyl-1,8-dihydro-imidazo[4,5-h]isoquinolin-9-one | CHEMBL281957
TypeSmall organic molecule
Emp. Form.C25H27Cl2N5O
Mol. Mass.484.421
SMILESCCN(CC)CC=Cc1[nH]c(=O)c2c3n(C)c(Nc4c(Cl)cccc4Cl)nc3ccc2c1C