Reaction Details
TargetTyrosine-protein kinase Lck
LigandBDBM50126744
Substrate/Competitorn/a
Meas. Tech.ChEMBL_221314 (CHEMBL841204)
IC50 180±n/a nM
Citation Goldberg, DRButz, TCardozo, MGEckner, RJHammach, AHuang, JJakes, SKapadia, SKashem, MLukas, SMorwick, TMPanzenbeck, MPatel, UPav, SPeet, GWPeterson, JDProkopowicz, ASSnow, RJSellati, RTakahashi, HTan, JTschantz, MAWang, XJWang, YWolak, JXiong, PMoss, N Optimization of 2-phenylaminoimidazo[4,5-h]isoquinolin-9-ones: orally active inhibitors of lck kinase. J Med Chem46:1337-49 (2003) 
 
Tyrosine-protein kinase Lck
Name:Tyrosine-protein kinase Lck
Type:n/a
Mol. Mass.:57987.83
Organism:Homo sapiens (Human)
Description:P06239
Residue:509
BDBM50126744
NameBDBM50126744
Synonyms:2-(2,6-Dichloro-phenylamino)-4-[(4-methoxy-benzylamino)-methyl]-1,6,7-trimethyl-1,8-dihydro-imidazo[4,5-h]isoquinolin-9-one | CHEMBL280565
TypeSmall organic molecule
Emp. Form.C28H27Cl2N5O2
Mol. Mass.536.452
SMILESCOc1ccc(CNCc2cc3c(C)c(C)[nH]c(=O)c3c3n(C)c(Nc4c(Cl)cccc4Cl)nc23)cc1