Reaction Details
TargetTyrosine-protein kinase SYK
LigandBDBM50126732
Substrate/Competitorn/a
Meas. Tech.ChEMBL_206956 (CHEMBL814843)
IC50>40000±n/a nM
Citation Goldberg, DRButz, TCardozo, MGEckner, RJHammach, AHuang, JJakes, SKapadia, SKashem, MLukas, SMorwick, TMPanzenbeck, MPatel, UPav, SPeet, GWPeterson, JDProkopowicz, ASSnow, RJSellati, RTakahashi, HTan, JTschantz, MAWang, XJWang, YWolak, JXiong, PMoss, N Optimization of 2-phenylaminoimidazo[4,5-h]isoquinolin-9-ones: orally active inhibitors of lck kinase. J Med Chem46:1337-49 (2003) 
 
Tyrosine-protein kinase SYK
Name:Tyrosine-protein kinase SYK
Type:Enzyme
Mol. Mass.:72079.99
Organism:Homo sapiens (Human)
Description:P43405
Residue:635
BDBM50126732
NameBDBM50126732
Synonyms:2-(2,6-Dichloro-phenylamino)-7-(3-diethylamino-propenyl)-1,6-dimethyl-1,8-dihydro-imidazo[4,5-h]isoquinolin-9-one | CHEMBL281957
TypeSmall organic molecule
Emp. Form.C25H27Cl2N5O
Mol. Mass.484.421
SMILESCCN(CC)CC=Cc1[nH]c(=O)c2c3n(C)c(Nc4c(Cl)cccc4Cl)nc3ccc2c1C