Reaction Details
TargetProtein kinase C alpha type
LigandBDBM50100126
Substrate/Competitorn/a
Meas. Tech.ChEMBL_160296 (CHEMBL769624)
Ki 31±n/a nM
Citation Sigano, DMPeach, MLNacro, KChoi, YLewin, NENicklaus, MCBlumberg, PMMarquez, VE Differential binding modes of diacylglycerol (DAG) and DAG lactones to protein kinase C (PK-C). J Med Chem46:1571-9 (2003) 
 
Protein kinase C alpha type
Name:Protein kinase C alpha type
Type:Enzyme
Mol. Mass.:76755.65
Organism:Homo sapiens (Human)
Description:The recombinant human PKC enzymes were produced using a baculovirus expression system in SF9 cells
Residue:672
BDBM50100126
NameBDBM50100126
Synonyms:3-Isopropyl-4-methyl-pent-2-enoic acid 1-hydroxymethyl-2-(3-isopropyl-4-methyl-pentanoyloxy)-ethyl ester | CHEMBL38644
TypeSmall organic molecule
Emp. Form.C21H38O5
Mol. Mass.370.5234
SMILES[#6]-[#6](-[#6])-[#6](-[#6]-[#6](=O)-[#8]-[#6]-[#6@H](-[#6]-[#8])-[#8]-[#6](=O)\[#6]=[#6](\[#6](-[#6])-[#6])-[#6](-[#6])-[#6])-[#6](-[#6])-[#6]