Reaction Details
TargetPeroxisome proliferator-activated receptor delta
LigandBDBM50127223
Substrate/Competitorn/a
Meas. Tech.ChEBML_153879
IC50 30±n/a nM
Citation Sznaidman, MLHaffner, CDMaloney, PRFivush, AChao, EGoreham, DSierra, MLLeGrumelec, CXu, HEMontana, VGLambert, MHWillson, TMOliver, WRSternbach, DD Novel selective small molecule agonists for peroxisome proliferator-activated receptor delta (PPARdelta)--synthesis and biological activity. Bioorg Med Chem Lett13:1517-21 (2003) Peroxisome proliferator-activated receptor delta
Name:Peroxisome proliferator-activated receptor delta
Type:Enzyme
Mol. Mass.:49910.45
Organism:Homo sapiens (Human)
Description:Q03181
Residue:441
BDBM50127223
NameBDBM50127223
Synonyms:CHEMBL37013 | {2-Methyl-4-[4-methyl-2-(4-trifluoromethyl-phenyl)-oxazol-5-ylmethoxy]-phenoxy}-acetic acid
TypeSmall organic molecule
Emp. Form.C21H18F3NO5
Mol. Mass.421.3665
SMILESCc1nc(oc1COc1ccc(OCC(O)=O)c(C)c1)-c1ccc(cc1)C(F)(F)F