Reaction Details
TargetPeroxisome proliferator-activated receptor delta
LigandBDBM50127221
Substrate/Competitorn/a
Meas. Tech.ChEMBL_153879 (CHEMBL759401)
IC50 3±n/a nM
Citation Sznaidman, MLHaffner, CDMaloney, PRFivush, AChao, EGoreham, DSierra, MLLeGrumelec, CXu, HEMontana, VGLambert, MHWillson, TMOliver, WRSternbach, DD Novel selective small molecule agonists for peroxisome proliferator-activated receptor delta (PPARdelta)--synthesis and biological activity. Bioorg Med Chem Lett13:1517-21 (2003) Peroxisome proliferator-activated receptor delta
Name:Peroxisome proliferator-activated receptor delta
Type:Enzyme
Mol. Mass.:49910.45
Organism:Homo sapiens (Human)
Description:Q03181
Residue:441
BDBM50127221
NameBDBM50127221
Synonyms:CHEMBL289887 | {2-Methyl-4-[4-methyl-2-(4-trifluoromethyl-phenyl)-oxazol-5-ylmethylsulfanyl]-phenoxy}-acetic acid
TypeSmall organic molecule
Emp. Form.C21H18F3NO4S
Mol. Mass.437.432
SMILESCc1nc(oc1CSc1ccc(OCC(O)=O)c(C)c1)-c1ccc(cc1)C(F)(F)F