Reaction Details
TargetPeroxisome proliferator-activated receptor alpha
LigandBDBM28661
Substrate/Competitorn/a
Meas. Tech.ChEBML_153706
EC50 2500±n/a nM
Citation Sznaidman, MLHaffner, CDMaloney, PRFivush, AChao, EGoreham, DSierra, MLLeGrumelec, CXu, HEMontana, VGLambert, MHWillson, TMOliver, WRSternbach, DD Novel selective small molecule agonists for peroxisome proliferator-activated receptor delta (PPARdelta)--synthesis and biological activity. Bioorg Med Chem Lett13:1517-21 (2003) Peroxisome proliferator-activated receptor alpha
Name:Peroxisome proliferator-activated receptor alpha
Type:PROTEIN
Mol. Mass.:52343.28
Organism:Mus musculus
Description:ChEMBL_572395
Residue:468
BDBM28661
NameBDBM28661
Synonyms:2-{2-methyl-4-[({4-methyl-2-[4-(trifluoromethyl)phenyl]-1,3-thiazol-5-yl}methyl)sulfanyl]phenoxy}acetic acid GW 501516 GW1516 | GW501516
TypeSmall organic molecule
Emp. Form.C21H18F3NO3S2
Mol. Mass.453.498
SMILESCc1nc(sc1CSc1ccc(OCC(O)=O)c(C)c1)-c1ccc(cc1)C(F)(F)F