Reaction Details
TargetPeroxisome proliferator-activated receptor delta
LigandBDBM50127222
Substrate/Competitorn/a
Meas. Tech.ChEBML_154038
EC50 30±n/a nM
Citation Sznaidman, MLHaffner, CDMaloney, PRFivush, AChao, EGoreham, DSierra, MLLeGrumelec, CXu, HEMontana, VGLambert, MHWillson, TMOliver, WRSternbach, DD Novel selective small molecule agonists for peroxisome proliferator-activated receptor delta (PPARdelta)--synthesis and biological activity. Bioorg Med Chem Lett13:1517-21 (2003) Peroxisome proliferator-activated receptor delta
Name:Peroxisome proliferator-activated receptor delta
Type:PROTEIN
Mol. Mass.:49719.14
Organism:Mus musculus
Description:ChEMBL_1288931
Residue:440
BDBM50127222
NameBDBM50127222
Synonyms:CHEMBL38508 {4-[2-(3-Fluoro-4-trifluoromethyl-phenyl)-4-methyl-thiazol-5-ylmethylsulfanyl]-2-methyl-phenoxy}-acetic acid
TypeSmall organic molecule
Emp. Form.C21H17F4NO3S2
Mol. Mass.471.488
SMILESCc1nc(sc1CSc1ccc(OCC(O)=O)c(C)c1)-c1ccc(c(F)c1)C(F)(F)F