Reaction Details
TargetAromatase
LigandBDBM50127280
Substrate/Competitorn/a
Meas. Tech.ChEBML_50700
IC50 90±n/a nM
Citation Marchand, PLe Borgne, MPalzer, MLe Baut, GHartmann, RW Preparation and pharmacological profile of 7-(alpha-azolylbenzyl)-1H-indoles and indolines as new aromatase inhibitors. Bioorg Med Chem Lett13:1553-5 (2003) Aromatase
Name:Aromatase
Type:Enzyme
Mol. Mass.:57888.92
Organism:Homo sapiens (Human)
Description:P11511
Residue:503
BDBM50127280
NameBDBM50127280
Synonyms:5-Bromo-1-ethyl-7-[(4-fluoro-phenyl)-imidazol-1-yl-methyl]-2,3-dihydro-1H-indole | CHEMBL287950
TypeSmall organic molecule
Emp. Form.C20H19BrFN3
Mol. Mass.400.287
SMILESCCN1CCc2cc(Br)cc(C(c3ccc(F)cc3)n3ccnc3)c12