Reaction Details
TargetIntegrin alpha-5/beta-1
LigandBDBM50127296
Substrate/Competitorn/a
Meas. Tech.ChEMBL_217628 (CHEMBL820371)
IC50 65000±n/a nM
Citation Bourguet, EBanères, JLParello, JLusinchi, XGirard, JPVidal, JP Nonpeptide RGD antagonists: a novel class of mimetics, the 5,8-disubstituted 1-azabicyclo[5.2.0]nonan-2-one lactam. Bioorg Med Chem Lett13:1561-4 (2003) Integrin alpha-5/beta-1
Name:Integrin alpha-5/beta-1
Type:Enzyme
Mol. Mass.:n/a
Description:n/a
Components:This complex has 2 components.
Component 1
Name:Integrin alpha-5
Synonyms:CD49 antigen-like family member E FNRA Fibronectin receptor subunit alpha ITGA5 Integrin alpha-F | VLA-5
Type:Single-pass type I membrane protein
Mol. Mass.:114523.00
Organism:Homo sapiens (Human)
Description:n/a
Residue:1049
Component 2
Name:Integrin beta-1
Synonyms:CD_antigen=CD29 Fibronectin receptor beta GPIIA ITGB1 MDF2 | MSK12
Type:Enzyme
Mol. Mass.:88400.38
Organism:Homo sapiens (Human)
Description:P05556
Residue:798
BDBM50127296
NameBDBM50127296
Synonyms:(R)-3-[(S)-5-(3-Guanidino-propylcarbamoyl)-2-oxo-1-aza-bicyclo[5.2.0]non-8-yl]-propionic acid | CHEMBL39700
TypeSmall organic molecule
Emp. Form.C16H27N5O4
Mol. Mass.353.4167
SMILESNC(=N)NCCCNC(=O)[C@H]1CCC(=O)N2C[C@H](CCC(O)=O)[C@H]2C1