Reaction Details
TargetGeranylgeranyl transferase type-1 subunit beta
LigandBDBM50127317
Substrate/Competitorn/a
Meas. Tech.ChEBML_71806
IC50 2100±n/a nM
Citation Tong, YLin, NHWang, LHasvold, LWang, WLeonard, NLi, TLi, QCohen, JGu, WZZhang, HStoll, VBauch, JMarsh, KRosenberg, SHSham, HL Discovery of potent imidazole and cyanophenyl containing farnesyltransferase inhibitors with improved oral bioavailability. Bioorg Med Chem Lett13:1571-4 (2003) Geranylgeranyl transferase type-1 subunit beta
Name:Geranylgeranyl transferase type-1 subunit beta
Type:n/a
Mol. Mass.:42369.84
Organism:Homo sapiens (Human)
Description:n/a
Residue:377
BDBM50127317
NameBDBM50127317
Synonyms:2-(4-Acetyl-piperazin-1-yl)-5-(3-chloro-phenyl)-6-[(4-cyano-phenyl)-(3-methyl-3H-imidazol-4-yl)-methoxymethyl]-nicotinonitrile | CHEMBL39805
TypeSmall organic molecule
Emp. Form.C31H28ClN7O2
Mol. Mass.566.053
SMILESCC(=O)N1CCN(CC1)c1nc(COC(c2cncn2C)c2ccc(cc2)C#N)c(cc1C#N)-c1cccc(Cl)c1