Reaction Details
TargetGeranylgeranyl transferase type-1 subunit beta
LigandBDBM50127321
Substrate/Competitorn/a
Meas. Tech.ChEBML_71806
IC50 1100±n/a nM
Citation Tong, YLin, NHWang, LHasvold, LWang, WLeonard, NLi, TLi, QCohen, JGu, WZZhang, HStoll, VBauch, JMarsh, KRosenberg, SHSham, HL Discovery of potent imidazole and cyanophenyl containing farnesyltransferase inhibitors with improved oral bioavailability. Bioorg Med Chem Lett13:1571-4 (2003) Geranylgeranyl transferase type-1 subunit beta
Name:Geranylgeranyl transferase type-1 subunit beta
Type:n/a
Mol. Mass.:42369.84
Organism:Homo sapiens (Human)
Description:n/a
Residue:377
BDBM50127321
NameBDBM50127321
Synonyms:5-[(4-Cyano-phenyl)-(3-methyl-3H-imidazol-4-yl)-methoxymethyl]-6-(2,2-difluoro-benzo[1,3]dioxol-5-yl)-pyridine-2-carbonitrile | CHEMBL41951
TypeSmall organic molecule
Emp. Form.C26H17F2N5O3
Mol. Mass.485.4417
SMILESCn1cncc1C(OCc1ccc(nc1-c1ccc2OC(F)(F)Oc2c1)C#N)c1ccc(cc1)C#N