Reaction Details
TargetGeranylgeranyl transferase type-1 subunit beta
LigandBDBM50127318
Substrate/Competitorn/a
Meas. Tech.ChEBML_71806
IC50 1800±n/a nM
Citation Tong, YLin, NHWang, LHasvold, LWang, WLeonard, NLi, TLi, QCohen, JGu, WZZhang, HStoll, VBauch, JMarsh, KRosenberg, SHSham, HL Discovery of potent imidazole and cyanophenyl containing farnesyltransferase inhibitors with improved oral bioavailability. Bioorg Med Chem Lett13:1571-4 (2003) Geranylgeranyl transferase type-1 subunit beta
Name:Geranylgeranyl transferase type-1 subunit beta
Type:n/a
Mol. Mass.:42369.84
Organism:Homo sapiens (Human)
Description:n/a
Residue:377
BDBM50127318
NameBDBM50127318
Synonyms:5-(3-Chloro-phenyl)-6-[(4-cyano-phenyl)-(3-methyl-3H-imidazol-4-yl)-methoxymethyl]-2-morpholin-4-yl-nicotinonitrile | CHEMBL434396
TypeSmall organic molecule
Emp. Form.C29H25ClN6O2
Mol. Mass.525.001
SMILESCn1cncc1C(OCc1nc(N2CCOCC2)c(cc1-c1cccc(Cl)c1)C#N)c1ccc(cc1)C#N