Reaction Details
TargetKappa-type opioid receptor
LigandBDBM50127355
Substrate/Competitorn/a
Meas. Tech.ChEBML_145961
Ki>1000±n/a nM
Citation Pagé, DNguyen, NBernard, SCoupal, MGosselin, MLepage, JAdam, LBrown, W New scaffolds in the development of mu opioid-receptor ligands. Bioorg Med Chem Lett13:1585-9 (2003) Kappa-type opioid receptor
Name:Kappa-type opioid receptor
Type:G Protein-Coupled Receptor (GPCR)
Mol. Mass.:42648.76
Organism:Homo sapiens (Human)
Description:P41145
Residue:380
BDBM50127355
NameBDBM50127355
Synonyms:(R)-2-({[(S)-3-(3-tert-Butyl-ureidomethyl)-3,4-dihydro-1H-isoquinoline-2-carbothioyl]-amino}-methyl)-pyrrolidine-1-carboxylic acid phenylamide | CHEMBL289320
TypeSmall organic molecule
Emp. Form.C28H38N6O2S
Mol. Mass.522.705
SMILESCC(C)(C)NC(=O)NC[C@@H]1Cc2ccccc2CN1C(=S)NC[C@H]1CCCN1C(=O)Nc1ccccc1