Reaction Details
Target72 kDa type IV collagenase
LigandBDBM50127481
Substrate/Competitorn/a
Meas. Tech.ChEMBL_104404 (CHEMBL715007)
Ki<2.8±n/a nM
Citation Cherney, RJDuan, JJVoss, MEChen, LWang, LMeyer, DTWasserman, ZRHardman, KDLiu, RQCovington, MBQian, MMandlekar, SChrist, DDTrzaskos, JMNewton, RCMagolda, RLWexler, RRDecicco, CP Design, synthesis, and evaluation of benzothiadiazepine hydroxamates as selective tumor necrosis factor-alpha converting enzyme inhibitors. J Med Chem46:1811-23 (2003) 
 
72 kDa type IV collagenase
Name:72 kDa type IV collagenase
Type:Enzyme
Mol. Mass.:73870.36
Organism:Homo sapiens (Human)
Description: P08253
Residue:660
BDBM50127481
NameBDBM50127481
Synonyms:2-(7-Benzyloxy-1,1-dioxo-1,3,4,5-tetrahydro-1lambda*6*-benzo[f][1,2,5]thiadiazepin-2-yl)-4-methyl-pentanoic acid hydroxyamide | CHEMBL431926
TypeSmall organic molecule
Emp. Form.C21H27N3O5S
Mol. Mass.433.521
SMILESCC(C)C[C@@H](N1CCNc2cc(OCc3ccccc3)ccc2S1(=O)=O)C(=O)NO