Reaction Details
TargetMatrix metalloproteinase-9
LigandBDBM50127450
Substrate/Competitorn/a
Meas. Tech.ChEMBL_105385 (CHEMBL710804)
Ki 100±n/a nM
Citation Cherney, RJDuan, JJVoss, MEChen, LWang, LMeyer, DTWasserman, ZRHardman, KDLiu, RQCovington, MBQian, MMandlekar, SChrist, DDTrzaskos, JMNewton, RCMagolda, RLWexler, RRDecicco, CP Design, synthesis, and evaluation of benzothiadiazepine hydroxamates as selective tumor necrosis factor-alpha converting enzyme inhibitors. J Med Chem46:1811-23 (2003) 
 
Matrix metalloproteinase-9
Name:Matrix metalloproteinase-9
Type:Enzyme
Mol. Mass.:78452.28
Organism:Homo sapiens (Human)
Description:P14780
Residue:707
BDBM50127450
NameBDBM50127450
Synonyms:CHEMBL51966 | N-Hydroxy-2-(7-hydroxy-1,1-dioxo-1,3,4,5-tetrahydro-1lambda*6*-benzo[f][1,2,5]thiadiazepin-2-yl)-propionamide
TypeSmall organic molecule
Emp. Form.C11H15N3O5S
Mol. Mass.301.319
SMILESC[C@@H](N1CCNc2cc(O)ccc2S1(=O)=O)C(=O)NO