Reaction Details
TargetDisintegrin and metalloproteinase domain-containing protein 17
LigandBDBM50127484
Substrate/Competitorn/a
Meas. Tech.ChEMBL_212590 (CHEMBL813237)
Ki 56±n/a nM
Citation Cherney, RJDuan, JJVoss, MEChen, LWang, LMeyer, DTWasserman, ZRHardman, KDLiu, RQCovington, MBQian, MMandlekar, SChrist, DDTrzaskos, JMNewton, RCMagolda, RLWexler, RRDecicco, CP Design, synthesis, and evaluation of benzothiadiazepine hydroxamates as selective tumor necrosis factor-alpha converting enzyme inhibitors. J Med Chem46:1811-23 (2003) 
 
Disintegrin and metalloproteinase domain-containing protein 17
Name:Disintegrin and metalloproteinase domain-containing protein 17
Type:Enzyme
Mol. Mass.:93007.89
Organism:Homo sapiens (Human)
Description:
Residue:824
BDBM50127484
NameBDBM50127484
Synonyms:2-[7-(3,5-Dimethoxy-benzylamino)-1,1-dioxo-1,3,4,5-tetrahydro-1lambda*6*-benzo[f][1,2,5]thiadiazepin-2-yl]-4-methyl-pentanoic acid hydroxyamide | CHEMBL54663
TypeSmall organic molecule
Emp. Form.C23H32N4O6S
Mol. Mass.492.588
SMILESCOc1cc(CNc2ccc3c(NCCN([C@H](CC(C)C)C(=O)NO)S3(=O)=O)c2)cc(OC)c1