Reaction Details
TargetDisintegrin and metalloproteinase domain-containing protein 17
LigandBDBM50127483
Substrate/Competitorn/a
Meas. Tech.ChEMBL_212590 (CHEMBL813237)
Ki 153±n/a nM
Citation Cherney, RJDuan, JJVoss, MEChen, LWang, LMeyer, DTWasserman, ZRHardman, KDLiu, RQCovington, MBQian, MMandlekar, SChrist, DDTrzaskos, JMNewton, RCMagolda, RLWexler, RRDecicco, CP Design, synthesis, and evaluation of benzothiadiazepine hydroxamates as selective tumor necrosis factor-alpha converting enzyme inhibitors. J Med Chem46:1811-23 (2003) 
 
Disintegrin and metalloproteinase domain-containing protein 17
Name:Disintegrin and metalloproteinase domain-containing protein 17
Type:Enzyme
Mol. Mass.:93007.89
Organism:Homo sapiens (Human)
Description:
Residue:824
BDBM50127483
NameBDBM50127483
Synonyms:2-[7-(3,5-Dichloro-benzyloxy)-1,1-dioxo-1,3,4,5-tetrahydro-1lambda*6*-benzo[f][1,2,5]thiadiazepin-2-yl]-N-hydroxy-propionamide | CHEMBL52893
TypeSmall organic molecule
Emp. Form.C18H19Cl2N3O5S
Mol. Mass.460.332
SMILESC[C@@H](N1CCNc2cc(OCc3cc(Cl)cc(Cl)c3)ccc2S1(=O)=O)C(=O)NO