Reaction Details
Target72 kDa type IV collagenase
LigandBDBM50127471
Substrate/Competitorn/a
Meas. Tech.ChEMBL_104404 (CHEMBL715007)
Ki 154±n/a nM
Citation Cherney, RJDuan, JJVoss, MEChen, LWang, LMeyer, DTWasserman, ZRHardman, KDLiu, RQCovington, MBQian, MMandlekar, SChrist, DDTrzaskos, JMNewton, RCMagolda, RLWexler, RRDecicco, CP Design, synthesis, and evaluation of benzothiadiazepine hydroxamates as selective tumor necrosis factor-alpha converting enzyme inhibitors. J Med Chem46:1811-23 (2003) 
 
72 kDa type IV collagenase
Name:72 kDa type IV collagenase
Type:Enzyme
Mol. Mass.:73870.36
Organism:Homo sapiens (Human)
Description: P08253
Residue:660
BDBM50127471
NameBDBM50127471
Synonyms:2-[7-(3,5-Dimethoxy-benzyloxy)-1,1-dioxo-1,3,4,5-tetrahydro-1lambda*6*-benzo[f][1,2,5]thiadiazepin-2-yl]-4-methyl-pentanoic acid hydroxyamide | CHEMBL293074
TypeSmall organic molecule
Emp. Form.C23H31N3O7S
Mol. Mass.493.573
SMILESCOc1cc(COc2ccc3c(NCCN([C@H](CC(C)C)C(=O)NO)S3(=O)=O)c2)cc(OC)c1