Reaction Details
TargetDisintegrin and metalloproteinase domain-containing protein 17
LigandBDBM50127480
Substrate/Competitorn/a
Meas. Tech.ChEMBL_212590 (CHEMBL813237)
Ki>1000±n/a nM
Citation Cherney, RJDuan, JJVoss, MEChen, LWang, LMeyer, DTWasserman, ZRHardman, KDLiu, RQCovington, MBQian, MMandlekar, SChrist, DDTrzaskos, JMNewton, RCMagolda, RLWexler, RRDecicco, CP Design, synthesis, and evaluation of benzothiadiazepine hydroxamates as selective tumor necrosis factor-alpha converting enzyme inhibitors. J Med Chem46:1811-23 (2003) 
 
Disintegrin and metalloproteinase domain-containing protein 17
Name:Disintegrin and metalloproteinase domain-containing protein 17
Type:Enzyme
Mol. Mass.:93007.89
Organism:Homo sapiens (Human)
Description:
Residue:824
BDBM50127480
NameBDBM50127480
Synonyms:2-(1,1-Dioxo-7-phenyl-1,3,4,5-tetrahydro-1lambda*6*-benzo[f][1,2,5]thiadiazepin-2-yl)-N-hydroxy-propionamide | CHEMBL298635
TypeSmall organic molecule
Emp. Form.C17H19N3O4S
Mol. Mass.361.415
SMILESC[C@@H](N1CCNc2cc(ccc2S1(=O)=O)-c1ccccc1)C(=O)NO