Reaction Details
TargetProthrombin
LigandBDBM50127496
Substrate/Competitorn/a
Meas. Tech.ChEMBL_208505 (CHEMBL811978)
Ki 440000±n/a nM
Citation Sagi, KNakagawa, TYamanashi, MMakino, STakahashi, MTakayanagi, MTakenaka, KSuzuki, NOono, SKataoka, NIshikawa, KShima, SFukuda, YKayahara, TTakehana, SShima, YTashiro, KYamamoto, HYoshimoto, RIwata, STsuji, TSakurai, KShoji, M Rational design, synthesis, and structure-activity relationships of novel factor Xa inhibitors: (2-substituted-4-amidinophenyl)pyruvic and -propionic acids. J Med Chem46:1845-57 (2003) 
 
Prothrombin
Name:Prothrombin
Type:Protein
Mol. Mass.:70029.57
Organism:Homo sapiens (Human)
Description:P00734
Residue:622
BDBM50127496
NameBDBM50127496
Synonyms:CHEMBL51796 | N-[2-(3-Carbamimidoyl-phenoxy)-ethyl]-4-[1-(1-imino-ethyl)-piperidin-4-yloxy]-benzamide
TypeSmall organic molecule
Emp. Form.C23H29N5O3
Mol. Mass.423.5081
SMILESCC(=N)N1CCC(CC1)Oc1ccc(cc1)C(=O)NCCOc1cccc(c1)C(N)=N