Reaction Details
TargetProthrombin
LigandBDBM50127502
Substrate/Competitorn/a
Meas. Tech.ChEMBL_208505 (CHEMBL811978)
Ki 680000±n/a nM
Citation Sagi, KNakagawa, TYamanashi, MMakino, STakahashi, MTakayanagi, MTakenaka, KSuzuki, NOono, SKataoka, NIshikawa, KShima, SFukuda, YKayahara, TTakehana, SShima, YTashiro, KYamamoto, HYoshimoto, RIwata, STsuji, TSakurai, KShoji, M Rational design, synthesis, and structure-activity relationships of novel factor Xa inhibitors: (2-substituted-4-amidinophenyl)pyruvic and -propionic acids. J Med Chem46:1845-57 (2003) 
 
Prothrombin
Name:Prothrombin
Type:Protein
Mol. Mass.:70029.57
Organism:Homo sapiens (Human)
Description:P00734
Residue:622
BDBM50127502
NameBDBM50127502
Synonyms:4-[5-Carbamimidoyl-2-(2-carboxy-2-oxo-ethyl)-phenoxy]-3-[(3,4,5,6-tetrahydro-2H-[1,4']bipyridinyl-4-carbonyl)-amino]-butyric acid | CHEMBL301368
TypeSmall organic molecule
Emp. Form.C25H29N5O7
Mol. Mass.511.5271
SMILESNC(=N)c1ccc(CC(=O)C(O)=O)c(OC[C@@H](CC(O)=O)NC(=O)C2CCN(CC2)c2ccncc2)c1