Reaction Details
TargetCoagulation factor X
LigandBDBM50127499
Substrate/Competitorn/a
Meas. Tech.ChEMBL_48812 (CHEMBL662835)
Ki 330±n/a nM
Citation Sagi, KNakagawa, TYamanashi, MMakino, STakahashi, MTakayanagi, MTakenaka, KSuzuki, NOono, SKataoka, NIshikawa, KShima, SFukuda, YKayahara, TTakehana, SShima, YTashiro, KYamamoto, HYoshimoto, RIwata, STsuji, TSakurai, KShoji, M Rational design, synthesis, and structure-activity relationships of novel factor Xa inhibitors: (2-substituted-4-amidinophenyl)pyruvic and -propionic acids. J Med Chem46:1845-57 (2003) 
 
Coagulation factor X
Name:Coagulation factor X
Type:Enzyme
Mol. Mass.:54726.60
Organism:Homo sapiens (Human)
Description:n/a
Residue:488
BDBM50127499
NameBDBM50127499
Synonyms:3-[4-Carbamimidoyl-2-(2-{4-[1-(1-imino-ethyl)-piperidin-4-yloxy]-benzoylamino}-ethoxy)-phenyl]-propionic acid | CHEMBL55486
TypeSmall organic molecule
Emp. Form.C26H33N5O5
Mol. Mass.495.5707
SMILESCC(=N)N1CCC(CC1)Oc1ccc(cc1)C(=O)NCCOc1cc(ccc1CCC(O)=O)C(N)=N