Reaction Details
TargetCoagulation factor X
LigandBDBM50127501
Substrate/Competitorn/a
Meas. Tech.ChEMBL_48812 (CHEMBL662835)
Ki 3±n/a nM
Citation Sagi, KNakagawa, TYamanashi, MMakino, STakahashi, MTakayanagi, MTakenaka, KSuzuki, NOono, SKataoka, NIshikawa, KShima, SFukuda, YKayahara, TTakehana, SShima, YTashiro, KYamamoto, HYoshimoto, RIwata, STsuji, TSakurai, KShoji, M Rational design, synthesis, and structure-activity relationships of novel factor Xa inhibitors: (2-substituted-4-amidinophenyl)pyruvic and -propionic acids. J Med Chem46:1845-57 (2003) 
 
Coagulation factor X
Name:Coagulation factor X
Type:Enzyme
Mol. Mass.:54726.60
Organism:Homo sapiens (Human)
Description:n/a
Residue:488
BDBM50127501
NameBDBM50127501
Synonyms:3-(4-Carbamimidoyl-2-{2-[4-(pyrrolidine-1-carbonyl)-benzoylamino]-ethoxy}-phenyl)-2-oxo-propionic acid | CHEMBL55139
TypeSmall organic molecule
Emp. Form.C24H26N4O6
Mol. Mass.466.4864
SMILESNC(=N)c1ccc(CC(=O)C(O)=O)c(OCCNC(=O)c2ccc(cc2)C(=O)N2CCCC2)c1