Reaction Details
TargetNeuromedin-B receptor
LigandBDBM50071745
Substrate/Competitorn/a
Meas. Tech.ChEMBL_141797 (CHEMBL748695)
EC50 120±n/a nM
Citation Weber, DBerger, CEickelmann, PAntel, JKessler, H Design of selective peptidomimetic agonists for the human orphan receptor BRS-3. J Med Chem46:1918-30 (2003) 
 
Neuromedin-B receptor
Name:Neuromedin-B receptor
Type:Enzyme Catalytic Domain
Mol. Mass.:43447.11
Organism:Homo sapiens (Human)
Description:Bombesin 1 NMBR 0::P28336
Residue:390
BDBM50071745
NameBDBM50071745
Synonyms:CHEMBL403317 Gly-Asn-Leu-Trp-Ala-Thr-Gly-His-Phe-Met-NH2(Neuromedin B) | NMB
TypeSmall organic molecule
Emp. Form.C52H73N15O12S
Mol. Mass.1132.294
SMILESCSCC[C@H](NC(=O)[C@H](Cc1ccccc1)NC(=O)[C@H](Cc1cnc[nH]1)NC(=O)CNC(=O)[C@@H](NC(=O)[C@H](C)NC(=O)[C@H](Cc1c[nH]c2ccccc12)NC(=O)[C@H](CC(C)C)NC(=O)[C@H](CC(N)=O)NC(=O)CN)[C@@H](C)O)C(N)=O