Reaction Details
TargetReverse transcriptase/RNaseH
LigandBDBM17676
Substrate/Competitorn/a
Meas. Tech.ChEMBL_197282 (CHEMBL804269)
EC50 2400±n/a nM
Citation Kroeger Smith, MBHose, BMHawkins, ALipchock, JFarnsworth, DWRizzo, RCTirado-Rives, JArnold, EZhang, WHughes, SHJorgensen, WLMichejda, CJSmith, RH Molecular modeling calculations of HIV-1 reverse transcriptase nonnucleoside inhibitors: correlation of binding energy with biological activity for novel 2-aryl-substituted benzimidazole analogues. J Med Chem46:1940-7 (2003) 
 
Reverse transcriptase/RNaseH
Name:Reverse transcriptase/RNaseH
Type:PROTEIN
Mol. Mass.:65229.15
Organism:Human immunodeficiency virus 1
Description:ChEMBL_1473730
Residue:566
BDBM17676
NameBDBM17676
Synonyms:2-(2,6-difluorophenyl)-1-[(2,6-difluorophenyl)methyl]-N-methyl-1H-1,3-benzodiazol-4-amine benzimidazole analogue, 58
TypeSmall organic molecule
Emp. Form.C21H15F4N3
Mol. Mass.385.3575
SMILESCNc1cccc2n(Cc3c(F)cccc3F)c(nc12)-c1c(F)cccc1F