Reaction Details
TargetReverse transcriptase/RNaseH
LigandBDBM17666
Substrate/Competitorn/a
Meas. Tech.ChEMBL_197282 (CHEMBL804269)
EC50 1700±n/a nM
Citation Kroeger Smith, MBHose, BMHawkins, ALipchock, JFarnsworth, DWRizzo, RCTirado-Rives, JArnold, EZhang, WHughes, SHJorgensen, WLMichejda, CJSmith, RH Molecular modeling calculations of HIV-1 reverse transcriptase nonnucleoside inhibitors: correlation of binding energy with biological activity for novel 2-aryl-substituted benzimidazole analogues. J Med Chem46:1940-7 (2003) 
 
Reverse transcriptase/RNaseH
Name:Reverse transcriptase/RNaseH
Type:PROTEIN
Mol. Mass.:65229.15
Organism:Human immunodeficiency virus 1
Description:ChEMBL_1473730
Residue:566
BDBM17666
NameBDBM17666
Synonyms:2-(2,6-difluorophenyl)-1-[(2,6-difluorophenyl)methyl]-1H-1,3-benzodiazole benzimidazole analogue, 2
TypeSmall organic molecule
Emp. Form.C20H12F4N2
Mol. Mass.356.3163
SMILESFc1cccc(F)c1Cn1c(nc2ccccc12)-c1c(F)cccc1F