Reaction Details
TargetReverse transcriptase/RNaseH
LigandBDBM50127556
Substrate/Competitorn/a
Meas. Tech.ChEMBL_197282 (CHEMBL804269)
EC50 45±n/a nM
Citation Kroeger Smith, MBHose, BMHawkins, ALipchock, JFarnsworth, DWRizzo, RCTirado-Rives, JArnold, EZhang, WHughes, SHJorgensen, WLMichejda, CJSmith, RH Molecular modeling calculations of HIV-1 reverse transcriptase nonnucleoside inhibitors: correlation of binding energy with biological activity for novel 2-aryl-substituted benzimidazole analogues. J Med Chem46:1940-7 (2003) 
 
Reverse transcriptase/RNaseH
Name:Reverse transcriptase/RNaseH
Type:PROTEIN
Mol. Mass.:65229.15
Organism:Human immunodeficiency virus 1
Description:ChEMBL_1473730
Residue:566
BDBM50127556
NameBDBM50127556
Synonyms:1-(2,6-difluorobenzyl)-2-(2,6-difluorophenyl)-4-(azidomethylene)benzimidazole CHEMBL57770
TypeSmall organic molecule
Emp. Form.C21H13F4N5
Mol. Mass.411.355
SMILESFc1cccc(F)c1Cn1c(nc2c(CN=[N+]=[N-])cccc12)-c1c(F)cccc1F