Reaction Details
TargetNischarin
LigandBDBM50127591
Substrate/Competitorn/a
Meas. Tech.ChEMBL_220592 (CHEMBL841871)
Ki 2±n/a nM
Citation Touzeau, FArrault, AGuillaumet, GScalbert, EPfeiffer, BRettori, MCRenard, PMérour, JY Synthesis and biological evaluation of new 2-(4,5-dihydro-1H-imidazol-2-yl)-3,4-dihydro-2H-1,4-benzoxazine derivatives. J Med Chem46:1962-79 (2003) 
 
Nischarin
Name:Nischarin
Type:Enzyme
Mol. Mass.:166571.31
Organism:Homo sapiens (Human)
Description:Q9Y2I1
Residue:1504
BDBM50127591
NameBDBM50127591
Synonyms:2-(4,5-Dihydro-1H-imidazol-2-yl)-4,6-dimethyl-3,4-dihydro-2H-benzo[1,4]oxazine | CHEMBL13987
TypeSmall organic molecule
Emp. Form.C13H17N3O
Mol. Mass.231.2936
SMILESCN1CC(Oc2ccc(C)cc12)C1=NCCN1