Reaction Details
TargetHistamine H2 receptor
LigandBDBM50127602
Substrate/Competitorn/a
Meas. Tech.ChEMBL_85521 (CHEMBL697132)
EC50>0.000100±n/a nM
Citation Kazuta, YHirano, KNatsume, KYamada, SKimura, RMatsumoto, SFuruichi, KMatsuda, AShuto, S Cyclopropane-based conformational restriction of histamine. (1S,2S)-2-(2-aminoethyl)-1-(1H-imidazol-4-yl)cyclopropane, a highly selective agonist for the histamine H3 receptor, having a cis-cyclopropane structure. J Med Chem46:1980-8 (2003) 
 
Histamine H2 receptor
Name:Histamine H2 receptor
Type:G Protein-Coupled Receptor (GPCR)
Mol. Mass.:40115.31
Organism:Homo sapiens (Human)
Description:n/a
Residue:359
BDBM50127602
NameBDBM50127602
Synonyms:C-[2-(1H-Imidazol-4-yl)-cyclopropyl]-methylamine | CHEMBL292924
TypeSmall organic molecule
Emp. Form.C7H11N3
Mol. Mass.137.1823
SMILESNC[C@H]1C[C@H]1c1cnc[nH]1