Reaction Details
TargetHistamine H1 receptor
LigandBDBM50127607
Substrate/Competitorn/a
Meas. Tech.ChEMBL_84417 (CHEMBL691450)
EC50>0.000100±n/a nM
Citation Kazuta, YHirano, KNatsume, KYamada, SKimura, RMatsumoto, SFuruichi, KMatsuda, AShuto, S Cyclopropane-based conformational restriction of histamine. (1S,2S)-2-(2-aminoethyl)-1-(1H-imidazol-4-yl)cyclopropane, a highly selective agonist for the histamine H3 receptor, having a cis-cyclopropane structure. J Med Chem46:1980-8 (2003) 
 
Histamine H1 receptor
Name:Histamine H1 receptor
Type:G Protein-Coupled Receptor (GPCR)
Mol. Mass.:55808.72
Organism:Homo sapiens (Human)
Description:Cell pellets from SK-N-MC cells transfected with human H1 receptor were used in binding assay.
Residue:487
BDBM50127607
NameBDBM50127607
Synonyms:(1R,2R)-2-(1H-Imidazol-4-yl)-cyclopropylamine 2-(1H-Imidazol-4-yl)-cyclopropylamine VUF-5296
TypeSmall organic molecule
Emp. Form.C6H9N3
Mol. Mass.123.1558
SMILESN[C@@H]1C[C@H]1c1cnc[nH]1