Reaction Details
TargetPlasminogen activator inhibitor 1
LigandBDBM50127741
Substrate/Competitorn/a
Meas. Tech.ChEBML_155613
IC50 470±n/a nM
Citation De Nanteuil, GLila-Ambroise, CRupin, AVallez, MOVerbeuren, TJ New fibrinolytic agents: benzothiophene derivatives as inhibitors of the t-PA-PAI-1 complex formation. Bioorg Med Chem Lett13:1705-8 (2003) Plasminogen activator inhibitor 1
Name:Plasminogen activator inhibitor 1
Type:Enzyme
Mol. Mass.:45064.00
Organism:Homo sapiens (Human)
Description:P05121
Residue:402
BDBM50127741
NameBDBM50127741
Synonyms:(E)-3-[5,6-Bis-benzyloxy-3-(4-chloro-phenoxy)-benzo[b]thiophen-2-yl]-2-pyridin-4-yl-acrylic acid methyl ester | CHEMBL47879
TypeSmall organic molecule
Emp. Form.C37H28ClNO5S
Mol. Mass.634.14
SMILESCOC(=O)C(=C\c1sc2cc(OCc3ccccc3)c(OCc3ccccc3)cc2c1Oc1ccc(Cl)cc1)\c1ccncc1