Reaction Details
TargetPlasminogen activator inhibitor 1
LigandBDBM50127742
Substrate/Competitorn/a
Meas. Tech.ChEBML_155613
IC50 220±n/a nM
Citation De Nanteuil, GLila-Ambroise, CRupin, AVallez, MOVerbeuren, TJ New fibrinolytic agents: benzothiophene derivatives as inhibitors of the t-PA-PAI-1 complex formation. Bioorg Med Chem Lett13:1705-8 (2003) Plasminogen activator inhibitor 1
Name:Plasminogen activator inhibitor 1
Type:Enzyme
Mol. Mass.:45064.00
Organism:Homo sapiens (Human)
Description:P05121
Residue:402
BDBM50127742
NameBDBM50127742
Synonyms:(E)-3-[5,6-Bis-(biphenyl-3-ylmethoxy)-3-(4-chloro-phenoxy)-benzo[b]thiophen-2-yl]-2-pyridin-4-yl-acrylic acid | CHEMBL298263
TypeSmall organic molecule
Emp. Form.C48H34ClNO5S
Mol. Mass.772.305
SMILESOC(=O)C(=C\c1sc2cc(OCc3cccc(c3)-c3ccccc3)c(OCc3cccc(c3)-c3ccccc3)cc2c1Oc1ccc(Cl)cc1)\c1ccncc1