Reaction Details
TargetATP-sensitive inward rectifier potassium channel 11
LigandBDBM50127761
Substrate/Competitorn/a
Meas. Tech.ChEBML_92724
EC50>10000±n/a nM
Citation Turner, SCCarroll, WAWhite, TKBrune, MEBuckner, SAGopalakrishnan, MFabiyi, ACoghlan, MJScott, VECastle, NADaza, AVMilicic, ISullivan, JP Structure-activity relationship of a novel class of naphthyl amide KATP channel openers. Bioorg Med Chem Lett13:1741-4 (2003) ATP-sensitive inward rectifier potassium channel 11
Name:ATP-sensitive inward rectifier potassium channel 11
Type:Enzyme Catalytic Domain
Mol. Mass.:43549.41
Organism:Homo sapiens (Human)
Description:Potassium channel (ATP modulatory) 0 0::Q14654
Residue:390
BDBM50127761
NameBDBM50127761
Synonyms:CHEMBL49390 | N-[2-(2,2,2-Trifluoro-1-hydroxy-1-trifluoromethyl-ethyl)-naphthalen-1-yl]-4-trifluoromethoxy-benzamide
TypeSmall organic molecule
Emp. Form.C21H12F9NO3
Mol. Mass.497.3105
SMILESOC(c1ccc2ccccc2c1NC(=O)c1ccc(OC(F)(F)F)cc1)(C(F)(F)F)C(F)(F)F