Reaction Details
TargetHistamine H3 receptor
LigandBDBM50127840
Substrate/Competitorn/a
Meas. Tech.ChEBML_83646
Ki 19±n/a nM
Citation Chai, WBreitenbucher, JGKwok, ALi, XWong, VCarruthers, NILovenberg, TWMazur, CWilson, SJAxe, FUJones, TK Non-imidazole heterocyclic histamine H3 receptor antagonists. Bioorg Med Chem Lett13:1767-70 (2003) Histamine H3 receptor
Name:Histamine H3 receptor
Type:G Protein-Coupled Receptor (GPCR)
Mol. Mass.:48691.47
Organism:Homo sapiens (Human)
Description:Binding assays were using CHO cells stably expressing hH3R receptors.
Residue:445
BDBM50127840
NameBDBM50127840
Synonyms:1-Ethyl-2-[4-(3-piperidin-1-yl-propoxy)-phenyl]-indolizine | CHEMBL49919
TypeSmall organic molecule
Emp. Form.C24H30N2O
Mol. Mass.362.5078
SMILESCCc1c(cn2ccccc12)-c1ccc(OCCCN2CCCCC2)cc1