Reaction Details
TargetHistamine H3 receptor
LigandBDBM50127845
Substrate/Competitorn/a
Meas. Tech.ChEBML_83646
Ki 152±n/a nM
Citation Chai, WBreitenbucher, JGKwok, ALi, XWong, VCarruthers, NILovenberg, TWMazur, CWilson, SJAxe, FUJones, TK Non-imidazole heterocyclic histamine H3 receptor antagonists. Bioorg Med Chem Lett13:1767-70 (2003) Histamine H3 receptor
Name:Histamine H3 receptor
Type:G Protein-Coupled Receptor (GPCR)
Mol. Mass.:48691.47
Organism:Homo sapiens (Human)
Description:Binding assays were using CHO cells stably expressing hH3R receptors.
Residue:445
BDBM50127845
NameBDBM50127845
Synonyms:2-[2-Methyl-4-(3-piperidin-1-yl-propoxy)-phenyl]-indolizine | CHEMBL299223
TypeSmall organic molecule
Emp. Form.C23H28N2O
Mol. Mass.348.4812
SMILESCc1cc(OCCCN2CCCCC2)ccc1-c1cc2ccccn2c1