Reaction Details
TargetHistamine H3 receptor
LigandBDBM50127841
Substrate/Competitorn/a
Meas. Tech.ChEBML_83646
Ki 13±n/a nM
Citation Chai, WBreitenbucher, JGKwok, ALi, XWong, VCarruthers, NILovenberg, TWMazur, CWilson, SJAxe, FUJones, TK Non-imidazole heterocyclic histamine H3 receptor antagonists. Bioorg Med Chem Lett13:1767-70 (2003) Histamine H3 receptor
Name:Histamine H3 receptor
Type:G Protein-Coupled Receptor (GPCR)
Mol. Mass.:48691.47
Organism:Homo sapiens (Human)
Description:Binding assays were using CHO cells stably expressing hH3R receptors.
Residue:445
BDBM50127841
NameBDBM50127841
Synonyms:2-[4-(3-Piperidin-1-yl-propoxy)-phenyl]-indolizine | CHEMBL52160
TypeSmall organic molecule
Emp. Form.C22H26N2O
Mol. Mass.334.4546
SMILESC(COc1ccc(cc1)-c1cc2ccccn2c1)CN1CCCCC1